line_name,specimen__id,specimen__name,specimen__hemisphere,structure__id,structure__name,structure__acronym,structure_parent__id,structure_parent__acronym,structure__layer,nr__max_euclidean_distance,nr__number_stems,nr__number_bifurcations,nr__average_contraction,nr__average_parent_daughter_ratio,nr__reconstruction_type,nrwkf__id,erwkf__id,ef__fast_trough_v_long_square,ef__upstroke_downstroke_ratio_long_square,ef__adaptation,ef__f_i_curve_slope,ef__threshold_i_long_square,ef__tau,ef__avg_isi,ef__avg_firing_rate,ef__ri,ef__peak_t_ramp,ef__vrest,si__height,si__width,si__path,csl__x,csl__y,csl__z,csl__normalized_depth,cell_reporter_status,m__glif,m__biophys,m__biophys_perisomatic,m__biophys_all_active,tag__apical,tag__dendrite_type,morph_thumb_path,ephys_thumb_path,ephys_inst_thresh_thumb_path,donor__age,donor__sex,donor__disease_state,donor__race,donor__years_of_seizure_history,donor__species,donor__id,donor__name
"",525011903,H16.03.003.01.14.02,right,12113,"""frontal lobe""",FroL,12113,FroL,3,,,,,,,,618211597,-53.8750038146973,2.89546090494073,0.0278459596639436,0.1671875,90,21.1810256736186,73.6783333333333,13.5725111407696,159.531131386757,4.10410666666667,-70.56103515625,,,,273,354,216,,,5,0,0,0,intact,spiny,,/api/v2/well_known_file_download/529903140,/api/v2/well_known_file_download/529903142,25 yrs,Male,epilepsy,White or Caucasian,9,Homo Sapiens,524848408,H16.03.003
Oxtr-T2A-Cre,565871768,Oxtr-2A-Cre;Ai14-293837.03.01.02,left,778,"""Primary visual area, layer 5""",VISp5,385,VISp,5,,,,,,,,659446233,-59.1875,1.56402714119508,,0.0203836930455635,270,11.2910900095904,,,119.977675378323,14.7372,-74.9269866943359,,,,8966.56330957526,1429.52689052075,8567.389672505,0.582056591439023,positive,2,0,0,0,NA,aspiny,,/api/v2/well_known_file_download/566738214,/api/v2/well_known_file_download/566738219,"","","","","",Mus musculus,563340157,Oxtr-T2A-Cre;Ai14-293837
Pvalb-IRES-Cre,469801138,Pvalb-IRES-Cre;Ai14-170927.05.02.01,right,721,"""Primary visual area, layer 4""",VISp4,385,VISp,4,,,,,,,,491200026,-55.6875038146973,1.16261835694738,0.000642588058309864,1.15678851174935,290,4.12168918958787,12.5075,79.9520287827304,65.6249970197678,11.7630225,-72.0429763793945,,,,7872.53138541818,993.212032389272,3127.15304714108,0.469578264738698,positive,0,0,0,0,NA,aspiny,,/api/v2/well_known_file_download/487618917,/api/v2/well_known_file_download/491380580,"","","","","",Mus musculus,319194354,Pvalb-IRES-Cre;Ai14(IVSCC)-170927
"",528642047,H16.06.009.01.02.06.05,left,12141,"""middle temporal gyrus""",MTG,12141,MTG,5,,,,,,,,681955656,-67.125,1.89188093800049,0.00160997020178726,0.73509272467903,90,12.6146414607861,12.9123684210526,77.445126052133,201.562687754631,,-69.2096099853516,,,,69,254,96,,,0,0,0,0,NA,aspiny,,/api/v2/well_known_file_download/660970973,/api/v2/well_known_file_download/660970975,48 yrs,Female,epilepsy,unknown,33,Homo Sapiens,528574320,H16.06.009
Slc32a1-T2A-FlpO|Vipr2-IRES2-Cre,605889373,Vipr2-IRES2-Cre;Slc32a1-T2A-FlpO;Ai65-337419.03.02.01,right,821,"""Primary visual area, layer 2/3""",VISp2/3,385,VISp,2/3,,,,,,,,657618169,-47.0937538146973,3.37932106468021,-0.015097529619921,0.19185329926349,280,5.16657372643037,78.9509090909091,12.666098611335,102.968707680702,8.4234,-72.7120361328125,,,,9400,1520.74232706376,2188.13845194139,,positive,2,0,0,0,NA,aspiny,,/api/v2/well_known_file_download/657612184,/api/v2/well_known_file_download/657612186,"","","","","",Mus musculus,605622695,Vipr2-IRES2-Cre;Slc32a1-T2A-FlpO;Ai65-337419
"",537256313,H16.03.006.01.05.02,right,12141,"""middle temporal gyrus""",MTG,12141,MTG,4,,,,,,,,618101624,-48.8125,3.1211816215221,0.0547842349457087,0.229195011337868,70,18.7427130300443,77.4,12.9198966408269,127.232253551483,5.67502666666667,-72.6281051635742,,,,322,255,92,,,2,0,0,0,truncated,spiny,,/api/v2/well_known_file_download/542174764,/api/v2/well_known_file_download/542174766,33 yrs,Female,epilepsy,unknown,6,Homo Sapiens,536912860,H16.03.006
Cux2-CreERT2,485909730,Cux2-CreERT2;Ai14-205530.03.02.01,right,778,"""Primary visual area, layer 5""",VISp5,385,VISp,5,446.97383394351,7,18,0.891127894162828,0.844376941289302,dendrite-only,500961530,491316386,-49.0000038146973,3.04293347960074,0.0323396179505003,0.25,70,20.5677674593068,55.895,17.8906878969496,213.124960660934,2.85131166666667,-76.9283905029297,7583,5744,/external/mousecelltypes/prod506/specimen_485909730/min_xy_485909730.aff,8881,953.839501299405,7768.22695782726,0.478343598387418,positive,0,1,1,0,intact,spiny,/api/v2/well_known_file_download/501086496,/api/v2/well_known_file_download/485911650,/api/v2/well_known_file_download/491381130,"","","","","",Mus musculus,485250100,Cux2-CreERT2;Ai14-205530
Scnn1a-Tg3-Cre,323865917,Scnn1a-Tg3-Cre;Ai14-172530.06.01.01,left,778,"""Primary visual area, layer 5""",VISp5,385,VISp,5,507.620655658534,6,35,0.876720334351633,0.883248879281861,dendrite-only,492413274,491200673,-47.75,2.97419423435741,0.0267317211648439,0.164285714285714,70,23.1827548873761,94.2335,10.6119373683457,166.250005364418,3.42154166666667,-69.4028549194336,9443,5762,/external/mousecelltypes/prod225/specimen_323865917/min_xy_323865917.aff,8125,904.841803028986,7819.69986630448,0.608589715882724,positive,0,1,1,0,intact,spiny,/api/v2/well_known_file_download/487660934,/api/v2/well_known_file_download/487629671,/api/v2/well_known_file_download/491384430,"","","","","",Mus musculus,322489588,Scnn1a-Tg3-Cre;Ai14(GSL)-172530
Htr3a-Cre_NO152,583836069,Htr3a-Cre_NO152;Ai14-314135.05.02.02,right,821,"""Primary visual area, layer 2/3""",VISp2/3,385,VISp,2/3,,,,,,,,644211026,-48.5937538146973,2.13231571411621,,0.0292989421736461,110,11.6573153251672,12.5,80,233.281165361404,,-62.0555801391602,,,,8294,828.8846152563,3320.65602051487,,positive,2,0,0,0,NA,aspiny,,/api/v2/well_known_file_download/606110998,/api/v2/well_known_file_download/606111003,"","","","","",Mus musculus,581538789,Htr3a-Cre_NO152;Ai14-314135
Rorb-IRES2-Cre,504615116,Rorb-IRES2-Cre-D;Ai14-234241.04.02.01,right,778,"""Primary visual area, layer 5""",VISp5,385,VISp,5,,,,,,,,566094316,-45.8437538146973,4.05999460039471,0.0147999527962489,0.177671232876712,70,18.3534585100392,92.074,10.8608293329279,164.062529802322,3.36571333333333,-69.3629837036133,,,,9022.31795341815,1034.01756171273,3750.09609106139,0.68479988993718,positive,5,0,0,0,intact,spiny,,/api/v2/well_known_file_download/511602811,/api/v2/well_known_file_download/511602813,"","","","","",Mus musculus,503871551,Rorb-IRES2-Cre-D;Ai14-234241
Ctgf-T2A-dgCre,558076716,Ctgf-2A-dgCre;Ai14(IVSCC)-280859.04.01.01,left,74,"""Lateral visual area, layer 6a""",VISl6a,409,VISl,6a,,,,,,,,659441525,-48.6250038146973,5.16440903077961,0.0306133983073091,0.130988030417411,110,13.7193053364636,92.6355555555556,10.7949911241184,125.937417149544,5.15529333333333,-70.4971466064453,,,,9226.81555310021,2289.94455323552,9055.32772884261,,positive,2,0,0,0,truncated,spiny,,/api/v2/well_known_file_download/559193810,/api/v2/well_known_file_download/559193812,"","","","","",Mus musculus,557265267,Ctgf-2A-dgCre;Ai14(IVSCC)-280859
Scnn1a-Tg3-Cre,476135066,Scnn1a-Tg3-Cre;Ai14-187849.06.01.01,left,721,"""Primary visual area, layer 4""",VISp4,385,VISp,4,456.764109672597,8,45,0.922705868334515,0.806499196930875,dendrite-only,512328422,491316017,-44.4687538146973,3.38631659246252,0.0986648819093415,0.139336926026596,130,25.2161656931662,113.287142857143,8.82712702235784,95.1785519719124,5.80315333333333,-75.0661315917969,7584,7583,/external/mousecelltypes/prod507/specimen_476135066/min_xy_476135066.aff,8711.26681152,1417.44904628,8895.04077315,0.419115970790224,positive,0,0,0,0,intact,spiny,/api/v2/well_known_file_download/512328571,/api/v2/well_known_file_download/491384500,/api/v2/well_known_file_download/491384504,"","","","","",Mus musculus,475849748,Scnn1a-Tg3-Cre;Ai14(IVSCC)-187849
Rorb-IRES2-Cre,502614426,Rorb-IRES2-Cre-D;Ai14-230822.04.02.01,right,869,"""Posterolateral visual area, layer 4""",VISpl4,425,VISpl,4,418.28577095089,8,27,0.851588490256285,0.787984448682699,dendrite-only,519262719,544847110,-51.375,3.94022133203199,0.0248267549401969,0.15546875,90,28.1795362452016,78.105,12.8032776390756,214.062571525574,3.87155333333333,-70.157844543457,5750,7586,/external/mousecelltypes/prod670/specimen_502614426/min_xy_502614426.aff,9918.74841340251,2116.91601361369,2202.77186959471,0.411748299578798,positive,0,0,0,0,intact,spiny,/api/v2/well_known_file_download/541010756,/api/v2/well_known_file_download/511853625,/api/v2/well_known_file_download/511853627,"","","","","",Mus musculus,502081962,Rorb-IRES2-Cre-D;Ai14-230822
"",519832676,H16.03.001.01.09.01,left,12141,"""middle temporal gyrus""",MTG,12141,MTG,3,504.253733142046,7,51,0.915422660611908,0.990668425592948,full,667320018,618213231,-47,4.57486453842852,0.179194027185622,0.0571428571428571,130,50.0490308584905,245.906666666667,4.06658352762565,146.874636411667,9.88393333333333,-72.5476608276367,9432,7582,/external/humancelltypes/prod44/specimen_519832676/min_xy_519832676.aff,79,273,91,0.29095064121937,,0,0,0,0,truncated,spiny,/api/v2/well_known_file_download/615966709,/api/v2/well_known_file_download/522910214,/api/v2/well_known_file_download/522910216,39 yrs,Male,epilepsy,White or Caucasian,19,Homo Sapiens,518641172,H16.03.001
Nkx2-1-CreERT2,581020172,Nkx2-1-CreERT2;Ai14 (IVSCC)-311666.03.01.01,left,821,"""Primary visual area, layer 2/3""",VISp2/3,385,VISp,2/3,,,,,,,,592971418,-54.6562538146973,1.28214906715888,0.00152932812328208,0.794242504372189,330,8.39470754288424,15.985,62.5586487331874,84.6873819828033,12.35868,-72.5855331420898,,,,9007.42136162164,865.328132411052,8068.80299257165,,positive,2,0,0,0,NA,aspiny,,/api/v2/well_known_file_download/587867760,/api/v2/well_known_file_download/587867766,"","","","","",Mus musculus,579671669,Nkx2-1-CreERT2;Ai14 (IVSCC)-311666
Pvalb-IRES-Cre,481127932,Pvalb-IRES-Cre;Ai14-199002.06.02.01,right,778,"""Primary visual area, layer 5""",VISp5,385,VISp,5,,,,,,,,496390184,-60.1562538146973,1.26391558451577,0.0187283963351565,1.47236471674603,290,9.26534750102426,9.03874999999998,110.634766975522,164.687469601631,10.2720816666667,-70.6443405151367,5744,3891,/external/mousecelltypes/prod511/specimen_481127932/min_xy_481127932.aff,8571.43849871717,1520.33945775248,2537.00682733199,0.582815456052957,positive,0,0,0,0,NA,aspiny,,/api/v2/well_known_file_download/483151576,/api/v2/well_known_file_download/491381001,"","","","","",Mus musculus,480773363,Pvalb-IRES-Cre;Ai14-199002
Rorb-IRES2-Cre,480087928,Rorb-IRES2-Cre-D;Ai14-197330.06.01.01,left,721,"""Primary visual area, layer 4""",VISp4,385,VISp,4,415.542767757809,4,21,0.8990427354402,0.877853350584097,dendrite-only,491770972,491198827,-48.5,3.52229179453099,0.0183919874829413,0.199214145383104,50,35.8412916818504,58.0516666666667,17.2260342798082,230.044677853584,3.172455,-73.2083282470703,9426,9426,/external/mousecelltypes/prod439/specimen_480087928/min_xy_480087928.aff,8190.00000000001,965.345563571091,8156.98088204066,0.446400413561292,positive,5,1,1,0,intact,spiny,/api/v2/well_known_file_download/487685988,/api/v2/well_known_file_download/491382097,/api/v2/well_known_file_download/491382099,"","","","","",Mus musculus,479695183,Rorb-IRES2-Cre-D;Ai14-197330
Htr3a-Cre_NO152,522257166,Htr3a-Cre_NO152;Ai14-249978.03.01.01,left,821,"""Primary visual area, layer 2/3""",VISp2/3,385,VISp,2/3,,,,,,,,567444821,-56.9062538146973,4.47381298910879,0.0167704502862876,0.175000009621892,110,10.3367179880801,64.4128571428571,15.5248508505401,192.455351352692,4.46743333333333,-75.0899429321289,,,,9296.54582374889,1524.44950303415,9140.85922196214,0.160683162037123,positive,2,0,0,0,NA,aspiny,,/api/v2/well_known_file_download/523998462,/api/v2/well_known_file_download/523998465,"","","","","",Mus musculus,520637948,Htr3a-Cre_NO152;Ai14-249978
Htr3a-Cre_NO152,327970859,Htr3a-Cre_NO152;Ai14-175482.05.02.01,right,721,"""Primary visual area, layer 4""",VISp4,385,VISp,4,,,,,,,,491197983,-59.78125,1.8614059156048,,0.016193853427896,40,15.4281779451872,7.99499999999997,125.078173858662,259.218811988831,,-67.1809234619141,5755,7600,/external/mousecelltypes/prod231/specimen_327970859/min_xy_327970859.aff,8915.7100716551,1379.3861586334,2571.48810778752,0.406030239502927,positive,0,0,0,0,NA,aspiny,,/api/v2/well_known_file_download/487609062,/api/v2/well_known_file_download/491376729,"","","","","",Mus musculus,325632898,Htr3a-Cre_NO152;Ai14(IVSCC)-175482
Vip-IRES-Cre,591517805,Vip-IRES-Cre;Ai14-319671.04.01.01,left,33,"""Primary visual area, layer 6a""",VISp6a,385,VISp,6a,,,,,,,,646446290,-51.21875,2.49393673910252,0.0236798492971572,0.0437125757718643,30,16.4532571940948,31.1071428571429,32.1469575200918,287.031292915344,1.61747,-66.0934371948242,,,,9053.27700660491,1589.12991046347,8323.9297066378,,positive,0,0,0,0,NA,aspiny,,/api/v2/well_known_file_download/606112153,/api/v2/well_known_file_download/606112157,"","","","","",Mus musculus,589751705,Vip-IRES-Cre;Ai14-319671
Chrna2-Cre_OE25,566506157,Chrna2-Cre_OE25;Ai14(IVSCC)-294466.03.01.01,left,778,"""Primary visual area, layer 5""",VISp5,385,VISp,5,,,,,,,,659441195,-43.4375038146973,3.70927867267576,0.0693499485940098,0.119047619460464,70,27.8601224233046,110.1175,9.08120870887915,179.6875,3.32536666666667,-72.9653167724609,,,,9236.69958653798,1214.07174003465,7853.24015383853,0.669927932035814,positive,0,0,0,0,intact,spiny,,/api/v2/well_known_file_download/568136806,/api/v2/well_known_file_download/568136812,"","","","","",Mus musculus,565087407,Chrna2-Cre_OE25;Ai14(IVSCC)-294466
Rorb-IRES2-Cre,479771670,Rorb-IRES2-Cre-D;Ai14-196665.03.02.01,right,821,"""Primary visual area, layer 2/3""",VISp2/3,385,VISp,2/3,,,,,,,,496605650,-51.9062538146973,3.04308034040575,0.0209720067003851,0.441304347141027,10,47.8952757472696,50.5384210526316,19.7869260489674,450.000107288361,1.59463833333333,-63.7343978881836,,,,8399.85778683815,717.829201553976,3398.20911227937,0.360961746088293,negative,0,0,0,0,NA,aspiny,,/api/v2/well_known_file_download/491377575,/api/v2/well_known_file_download/491377577,"","","","","",Mus musculus,479695167,Rorb-IRES2-Cre-D;Ai14-196665
Cux2-CreERT2,513593674,Cux2-CreERT2;Ai14-239082.05.01.01,left,821,"""Primary visual area, layer 2/3""",VISp2/3,385,VISp,2/3,,,,,,,,567445828,-47.78125,3.63151189770886,0.130370892947596,0.0313543562831141,150,15.4000760796152,74.37,13.4462821029985,134.687542915344,5.12449333333333,-81.1610488891602,,,,9035.61577467492,864.671601580766,7925.70842298861,0.363079633568215,positive,5,0,0,0,intact,spiny,,/api/v2/well_known_file_download/515020935,/api/v2/well_known_file_download/515020938,"","","","","",Mus musculus,510023677,Cux2-CreERT2;Ai14-239082
Htr3a-Cre_NO152,583822407,Htr3a-Cre_NO152;Ai14-314135.02.02.01,right,821,"""Primary visual area, layer 2/3""",VISp2/3,385,VISp,2/3,,,,,,,,659442572,-50.15625,2.73294815696455,0.231692677070838,0.0241279069767442,40,16.3125149554193,8.33000000000006,120.048019207682,283.593744039536,2.57226,-70.6770324707031,,,,9351.33869899615,667.238044534289,3767.40752234676,,positive,2,0,0,0,NA,aspiny,,/api/v2/well_known_file_download/606110994,/api/v2/well_known_file_download/606111001,"","","","","",Mus musculus,581538789,Htr3a-Cre_NO152;Ai14-314135
"",596020931,H17.06.009.11.04.02,left,12141,"""middle temporal gyrus""",MTG,12141,MTG,4,431.249929293374,4,13,0.850827105250579,0.903432699259515,full,657984302,618072118,-63.5625038146973,1.4528902963157,0.196551724137939,0.0148936164573392,210,7.17732109498307,5.79999999999992,172.413793103451,65.7812505960464,14.6665866666667,-74.2602691650391,9442,11281,/external/humancelltypes/prod194/specimen_596020931/min_xy_596020931.aff,66,220,105,0.497824567421906,,2,0,0,0,NA,aspiny,/api/v2/well_known_file_download/690895038,/api/v2/well_known_file_download/606115817,/api/v2/well_known_file_download/606115823,52 yrs,Male,tumor,White or Caucasian,0,Homo Sapiens,595954915,H17.06.009
"",569095789,H17.06.004.11.05.04,left,12136,"""angular gyrus""",AnG,12136,AnG,2,228.889283299568,5,22,0.821115772235822,1,full,599474136,616987883,-51.0625038146973,2.19987196375147,0.0934923432200287,0.15,130,14.0551868750163,112.245,8.90908280992472,114.989154040813,5.45684,-81.0659713745117,7572,7589,/external/humancelltypes/prod140/specimen_569095789/min_xy_569095789.aff,110,122,240,0.056400381011851,,0,0,0,0,intact,spiny,/api/v2/well_known_file_download/615967060,/api/v2/well_known_file_download/593313919,/api/v2/well_known_file_download/593313924,71 yrs,Female,tumor,unknown,0,Homo Sapiens,569008241,H17.06.004
Vip-IRES-Cre,585080288,Vip-IRES-Cre;Ai14-315368.04.01.01,left,33,"""Primary visual area, layer 6a""",VISp6a,385,VISp,6a,,,,,,,,659450315,-49.4687538146973,3.42351007502397,0.0103229397851398,0.0191964285714286,50,18.3563685750736,28.8036363636364,34.7178386567352,231.875032186508,2.658145,-64.7030563354492,,,,8755.21531421366,1123.35765144039,7448.13158915937,,positive,2,0,0,0,NA,aspiny,,/api/v2/well_known_file_download/606111416,/api/v2/well_known_file_download/606111418,"","","","","",Mus musculus,583090832,Vip-IRES-Cre;Ai14-315368
"",576095991,H17.06.007.11.08.01,right,12116,"""middle frontal gyrus""",MFG,12116,MFG,5,262.336589789263,8,33,0.817674203742556,1,full,610882077,618226160,-56.9062538146973,2.52061630228839,0.00532694714517941,0.179186602289983,70,18.5390718014029,72.9953846153846,13.6994962800599,179.843753576279,3.228,-64.4421920776367,7564,5737,/external/humancelltypes/prod166/specimen_576095991/min_xy_576095991.aff,274,331,228,0.673428137802,,2,0,0,0,NA,aspiny,/api/v2/well_known_file_download/615967127,/api/v2/well_known_file_download/591251785,/api/v2/well_known_file_download/591251790,42 yrs,Female,tumor,White or Caucasian,0,Homo Sapiens,576060516,H17.06.007
"",545608578,H16.03.010.13.06.01,right,12141,"""middle temporal gyrus""",MTG,12141,MTG,3,,,,,,,,743068257,-50.34375,3.67543007940544,,0.0540354330708661,560,12.999426938348,,,37.4998860061169,22.06694,-74.4962615966797,,,,312,280,89,,,0,0,0,0,intact,spiny,,/api/v2/well_known_file_download/743062878,/api/v2/well_known_file_download/743062880,48 yrs,Male,epilepsy,White or Caucasian,4,Homo Sapiens,545510854,H16.03.010
"",561467633,H16.06.013.12.08.05,left,12141,"""middle temporal gyrus""",MTG,12141,MTG,3,,,,,,,,742807042,-50.7500038146973,4.14999807269852,,0.0305379759365691,150,34.6791948163376,36.3199999999999,27.5330396475772,75.1562491059303,6.43710666666667,-69.6266098022461,,,,79,273,86,,,0,0,0,0,truncated,spiny,,/api/v2/well_known_file_download/563806433,/api/v2/well_known_file_download/563806435,34 yrs,Female,epilepsy,Black or African American,9,Homo Sapiens,561414332,H16.06.013
Nos1-CreERT2|Sst-IRES-FlpO,572410577,Nos1-CreERT2;Sst-IRES-FlpO;Ai65-299579.04.01.01,left,778,"""Primary visual area, layer 5""",VISp5,385,VISp,5,,,,,,,,659446122,-62.4687538146973,1.97094406925803,0.123166145717213,0.122592591027686,30,37.8183672710174,123.542857142857,8.09435707678077,322.187542915344,1.92671333333333,-67.0471649169922,,,,8646.14258496886,1041.82729070927,7628.69085263281,,positive,2,0,0,0,NA,aspiny,,/api/v2/well_known_file_download/574390623,/api/v2/well_known_file_download/574390625,"","","","","",Mus musculus,571780386,Nos1-CreERT2;Sst-IRES-FlpO;Ai65-299579
Scnn1a-Tg3-Cre,470098860,Scnn1a-Tg3-Cre;Ai14-181566.04.01.01,left,721,"""Primary visual area, layer 4""",VISp4,385,VISp,4,,,,,,,,491201459,-54.0937538146973,3.27833411953462,0.0284172256614396,0.227150547425861,100,26.756291884707,61.0526666666667,16.3793009314362,179.687470197678,4.44017166666667,-80.1294937133789,,,,8946,1049.47686967241,8202.56063466474,0.372868197228426,positive,5,0,0,0,intact,spiny,,/api/v2/well_known_file_download/487634112,/api/v2/well_known_file_download/491377686,"","","","","",Mus musculus,418778127,Scnn1a-Tg3-Cre;Ai14(IVSCC)-181566
"",528706755,H16.06.009.01.01.15.01,left,12141,"""middle temporal gyrus""",MTG,12141,MTG,2,437.04064383525,8,42,0.884662603690549,0.976747750019144,dendrite-only,722014889,743065536,-46.90625,2.80618139261634,0.306257294021868,0.0726303305565609,230,33.7427066555222,168.45,5.93647966755714,78.1251937150955,10.1711,-72.4901351928711,7614,11280,/external/humancelltypes/prod279/specimen_528706755/min_xy_528706755.aff,70,260,108,0.134666551732475,,0,0,0,0,intact,spiny,/api/v2/well_known_file_download/722062393,/api/v2/well_known_file_download/660971872,/api/v2/well_known_file_download/660971874,48 yrs,Female,epilepsy,unknown,33,Homo Sapiens,528574320,H16.06.009
Rorb-IRES2-Cre,473611755,Rorb-IRES2-Cre-D;Ai14-181715.03.01.01,left,821,"""Primary visual area, layer 2/3""",VISp2/3,385,VISp,2/3,318.040615932997,5,22,0.89998330953772,0.82193799393301,dendrite-only,491253838,496389059,-47.84375,3.12721730363885,,0.0158742935628127,250,11.459694659171,,,107.968866825104,7.79090666666667,-82.7531585693359,5736,3892,/external/mousecelltypes/prod340/specimen_473611755/min_xy_473611755.aff,8983.96602419027,896.579275114655,8186.01779636337,0.313011387767044,positive,0,0,0,0,intact,spiny,/api/v2/well_known_file_download/489405258,/api/v2/well_known_file_download/487625197,/api/v2/well_known_file_download/491377281,"","","","","",Mus musculus,472963244,Rorb-IRES2-Cre-D;Ai14(IVSCC)-181715
Nkx2-1-CreERT2,580537822,Nkx2-1-CreERT2;Ai14 (IVSCC)-311671.04.02.02,right,778,"""Primary visual area, layer 5""",VISp5,385,VISp,5,,,,,,,,592971397,-53.3750038146973,3.03724719576329,-0.0079762316985848,0.265588245744275,130,10.7532585271745,57.9066666666667,17.2691687773428,174.999997019768,5.24884,-68.0887222290039,,,,8617.64837926385,1476.7592705822,2876.13839694213,,positive,5,0,0,0,NA,aspiny,,/api/v2/well_known_file_download/587867521,/api/v2/well_known_file_download/587867526,"","","","","",Mus musculus,579671688,Nkx2-1-CreERT2;Ai14 (IVSCC)-311671
Scnn1a-Tg3-Cre,479091820,Scnn1a-Tg3-Cre;Ai14-195195.04.02.01,right,721,"""Primary visual area, layer 4""",VISp4,385,VISp,4,,,,,,,,501272568,-46,3.13929932545215,0.258176905720702,-0.00338052300968143,110,19.1436016614458,104.791666666667,9.54274353876736,154.107108712196,5.95392166666667,-78.5531539916992,7543,5732,/external/mousecelltypes/prod424/specimen_479091820/min_xy_479091820.aff,9030.34918411327,832.558651793604,3681.91310831678,0.462671613836927,positive,0,0,0,0,intact,spiny,,/api/v2/well_known_file_download/491384644,/api/v2/well_known_file_download/491384646,"","","","","",Mus musculus,478594016,Scnn1a-Tg3-Cre;Ai14(IVSCC)-195195
"",530055374,H16.06.010.01.03.14.01,left,12141,"""middle temporal gyrus""",MTG,12141,MTG,3,,,,,,,,616981108,-51,3.52250043400882,,0.0080321276546557,230,35.0195767843793,,,70.000022649765,19.9026,-74.5511016845703,,,,70,260,111,,,2,0,0,0,truncated,spiny,,/api/v2/well_known_file_download/603329494,/api/v2/well_known_file_download/603329496,67 yrs,Male,epilepsy,White or Caucasian,3,Homo Sapiens,529678110,H16.06.010
Pvalb-IRES-Cre,475549334,Pvalb-IRES-Cre;Ai14-185362.03.01.01,left,778,"""Primary visual area, layer 5""",VISp5,385,VISp,5,345.390821720323,4,15,0.905298393934445,0.964713713261636,dendrite-only,491119984,491200305,-66.0625,1.30883421463085,0.00523644428043449,1.64510904338246,400,5.29061521955921,3.82833333333332,261.210274270789,85.1562470197678,14.9685383333333,-72.20556640625,7587,5757,/external/mousecelltypes/prod362/specimen_475549334/min_xy_475549334.aff,8976.63502144556,1295.51331478617,8057.36086373136,0.711457973538847,positive,0,1,0,1,NA,aspiny,/api/v2/well_known_file_download/487661703,/api/v2/well_known_file_download/491384435,/api/v2/well_known_file_download/491384437,"","","","","",Mus musculus,475196647,Pvalb-IRES-Cre;Ai14(IVSCC)-185362